{"text_format":"1","workbook":"xlsx","n_sheets":13,"sheets":["Instructions","Population","Water Use Per Capita","Water Supply","Potable Water Treatment ","Results","State Water Project Data","Colorado River Water Data","Potable Water Treatment Data","E for Treatment Data","Groundwater Data","E for Groundwater Data","Default Energy Data"],"not_rendered":{"charts":2,"images":4,"macros":1,"external_links":0,"defined_names":0,"comments":0,"pivot_tables":0},"unopened":[],"bounds":{"document_bytes":16777216,"sheet_cells":100000,"rows_first":2000,"rows_last":500,"rows_between":2000,"halvings":0,"cell_chars":16384,"cell_head_chars":4096},"cells_cut":0,"cells_raw":0,"read":"whole","date_system":"1900"}

{"sheet":"Instructions","index":0,"n_rows":16,"n_cols":4,"rows_kept":16,"cut":false,"hidden":false,"merged":[[11,3,26,7],[11,1,12,1],[15,1,26,1],[10,3,10,7],[0,1,0,7],[1,1,1,7],[2,1,8,7]]}
[null,"Energy Related Emissions Associated With Water Supply, Delivery, and Treatment"]
[null,"Introduction"]
[null,"The consumption of water by a community's residents and businesses can have a significant Green House Gas (GHG) implications depending on the source, treatment, distance, and topography traversed.  Incorporating the relationship between water and energy consumption in a GHG inventory allows a community to use water conservation and policy measures as a GHG emissions reduction strategy.  This tool allows the user to estimate GHG emissions from 1990-2050 regardless of data availability.  The tool can be used with 3 levels of data: Required Data, Suggested Data, and Detailed Data or any combination of the 3.  Yellow cells in each worksheet can take user input, blue cells are calculated values, and tan cells provide detailed instructions."]
[]
[]
[]
[]
[]
{"$rows_left_out":9}
{"sheet":"Population","index":1,"n_rows":79,"n_cols":13,"rows_kept":79,"cut":false,"hidden":false,"merged":[[0,11,0,16],[19,1,19,8],[18,12,22,16],[5,12,7,16],[1,12,4,16],[13,12,16,16],[9,12,11,16],[78,2,78,9],[0,1,0,4],[26,1,26,5],[2,1,2,4],[1,1,1,4],[24,2,24,8],[3,1,3,4],[5,1,5,8],[36,1,36,5],[10,2,10,8],[12,1,12,8]]}
[null,"1990 Population:",null,null,null,null,null,null,null,null,null,"Instructions"]
[null,"2000 Population:",null,null,null,null,null,null,null,null,null,"Step 1:","Population data for 1990, 2000, 2010, and present must be entered.  This data can be found at: http://www.census.gov/main/www/cen2000.html"]
[null,"2010 Population:"]
[null,"Current Population:"]
[]
[null,"Known Population",null,null,null,null,null,null,null,null,null,"Step 2:","If know, please enter the projected population for 2020, 2030, 2040, and 2050.  If not know, please leave blank.  "]
[null,null,1990,2000,2010,2020,2030,2040,2050]
[null,"Population",{"$f":"F1","v":0},2846289,{"$f":"F3","v":0}]
{"$rows_left_out":72}
{"sheet":"Water Use Per Capita","index":2,"n_rows":79,"n_cols":13,"rows_kept":79,"cut":false,"hidden":false,"merged":[[1,1,1,4],[1,11,1,16],[2,1,2,4],[3,1,3,4],[6,1,6,8],[25,2,25,8],[27,1,27,5],[78,2,78,9],[2,12,4,16],[4,1,4,4],[6,12,8,16],[17,12,21,16],[9,12,11,16],[11,2,11,8],[13,1,13,8],[13,12,16,16],[20,1,20,8],[37,1,37,5]]}
[]
[null,"Current Per Capita Water Use (gpd):",null,null,null,null,null,null,null,null,null,"Instructions"]
[null,"1990 Per Capita Water Use:",null,null,null,null,null,null,null,null,null,"Step 1:","If current, 1990, 2000, and 2010 per capita water use is know, enter here.  If only current per capita water use is know, enter it leaving the others blank.  If none are know the default value will be used. "]
[null,"2000 Per Capita Water Use:"]
[null,"2010 Per Capita Water Use:"]
[]
[null,"Projected Per Capita Water Use",null,null,null,null,null,null,null,null,null,"Step 2:","If projected per capita water  use data is known please enter it here, if not please leave blank.  "]
[null,null,1990,2000,2010,2020,2030,2040,2050]
{"$rows_left_out":72}
{"sheet":"Water Supply","index":3,"n_rows":78,"n_cols":12,"rows_kept":78,"cut":false,"hidden":false,"merged":[[77,2,77,8],[16,11,20,15],[18,1,18,8],[22,2,22,8],[26,1,26,5],[27,1,27,5],[28,1,28,5],[37,1,37,5],[12,11,15,15],[2,1,2,4],[1,10,1,15],[3,1,3,4],[2,11,4,15],[4,1,4,4],[1,1,1,4],[6,1,6,8],[6,11,8,15],[9,11,10,15],[10,2,10,8],[12,1,12,8]]}
[]
[null,"Percent Groundwater Use:",null,null,null,null,null,null,null,null,"Instructions"]
[null,"Percent State Water Project:",null,null,null,null,null,null,null,null,"Step 1:","If percentage of water use for the area is know for groundwater, State Water Project, and Colorado River Water, please enter here. "]
[null,"Percent Colorado River Water:"]
[null,"Percent Self-Supplied Water Use:",null,null,null,{"$f":"IF(ISBLANK(F2),G29,1-F2-F3-F4)","v":7.0000000000000007E-2}]
[]
[null,"Groundwater",null,null,null,null,null,null,null,null,"Step 2:","If annual groundwater use data is known please enter it here, if not please leave blank."]
[null,null,1990,2000,2010,2020,2030,2040,2050]
{"$rows_left_out":71}
{"sheet":"Potable Water Treatment ","index":4,"n_rows":78,"n_cols":12,"rows_kept":78,"cut":false,"hidden":false,"merged":[[1,1,1,4],[1,10,1,15],[2,1,2,4],[2,11,4,15],[3,1,3,4],[4,1,4,4],[6,1,6,8],[6,11,8,15],[9,11,11,15],[11,2,11,8],[13,1,13,8],[13,11,16,15],[17,11,21,15],[20,1,20,8],[25,2,25,8],[27,1,27,5],[77,2,77,9],[37,1,37,5]]}
[]
[null,"Current Average Daily Flow to Treatment Plant (MGD):",null,null,null,null,null,null,null,null,"Instructions"]
[null,"1990 Average Daily Flow to Treatment Plant (MGD):",null,null,null,null,null,null,null,null,"Step 1:","If current, 1990, 2000, and 2010 flow to treatment plant is know enter here.  If only current is know, enter it leaving the other blank.  If none are know the default Southern California default will be used. "]
[null,"2000 Average Daily Flow to Treatment Plant (MGD):"]
[null,"2010 Average Daily Flow to Treatment Plant (MGD):"]
[]
[null,"Projected Per Capita Water Use",null,null,null,null,null,null,null,null,"Step 2:","If projected per capita water  use data is known please enter it here, if not please leave blank.  "]
[null,null,1990,2000,2010,2020,2030,2040,2050]
{"$rows_left_out":71}
{"sheet":"Results","index":5,"n_rows":27,"n_cols":15,"rows_kept":27,"cut":false,"hidden":false,"merged":[[17,13,20,14],[22,13,25,14],[1,0,1,12],[14,12,14,13],[16,12,16,14]]}
[]
["Final Values for Computation of Total Annual Emissions"]
[null,"Groundwater (gpd)","Surface Water (gpd)","Groundwater Intensity (KWh/MG)","Supply & Conveyance Intensity (KWh/MG)","Treatment Intensity (KWh/MG)","Distribution Intensity (KWh/MG)","Electricity Emission Factors (kg CO2 eq./MWh)","Annual Groundwater Extraction Emissions (mtCO2e)","Annual Conveyance Emissions (mtCO2e)","Annual Treatment Emissions (mtCO2e)","Annual Distribution Emissions (mtCO2e)","Total Annual Emissions (mtCO2e)"]
[1990,{"$f":"Population!C39*'Water Use Per Capita'!C40*'Water Supply'!C40","v":0},{"$f":"Population!C39*'Water Use Per Capita'!C40*'Water Supply'!C41","v":0},{"$f":"IF('E for Groundwater Data'!Q3=0,'Default Energy Data'!$E$4,'E for Groundwater Data'!Q3)","v":540},{"$f":"'Default Energy Data'!$K$4","v":8900},{"$f":"IF('E for Treatment Data'!Q3=0,IF('E for Treatment Data'!P29=0,'Default Energy Data'!$K$5,'E for Treatment Data'!P29),'E for Treatment Data'!Q3)","v":496.3023483680999},{"$f":"'Default Energy Data'!$K$6","v":1200},{"$f":"'Default Energy Data'!F24/2.205","v":469.92743764172337},{"$f":"B4*365*0.000001*D4*H4*0.001*0.001","v":0},{"$f":"C4*365*0.000001*E4*H4*0.001*0.001","v":0},{"$f":"(B4+C4)*365*0.000001*F4*H4*0.001*0.001","v":0},{"$f":"(B4+C4)*365*0.000001*G4*H4*0.001*0.001","v":0},{"$f":"SUM(I4:L4)","v":0}]
[2000,{"$f":"Population!D39*'Water Use Per Capita'!D40*'Water Supply'!D40","v":0},{"$f":"Population!D39*'Water Use Per Capita'!D40*'Water Supply'!D41","v":0},{"$f":"IF('E for Groundwater Data'!Q4=0,'Default Energy Data'!$E$4,'E for Groundwater Data'!Q4)","v":540},{"$f":"'Default Energy Data'!$K$4","v":8900},{"$f":"IF('E for Treatment Data'!Q13=0,IF('E for Treatment Data'!P30=0,'Default Energy Data'!$K$5,'E for Treatment Data'!P30),'E for Treatment Data'!Q13)","v":496.3023483680999},{"$f":"'Default Energy Data'!$K$6","v":1200},{"$f":"'Default Energy Data'!F34/2.205","v":380.87074829931976},{"$f":"B5*365*0.000001*D5*H5*0.001*0.001","v":0},{"$f":"C5*365*0.000001*E5*H5*0.001*0.001","v":0},{"$f":"(B5+C5)*365*0.000001*F5*H5*0.001*0.001","v":0},{"$f":"(B5+C5)*365*0.000001*G5*H5*0.001*0.001","v":0},{"$f":"SUM(I5:L5)","v":0}]
[2010,{"$f":"Population!E39*'Water Use Per Capita'!E40*'Water Supply'!E40","v":0},{"$f":"Population!E39*'Water Use Per Capita'!E40*'Water Supply'!E41","v":0},{"$f":"IF('E for Groundwater Data'!Q5=0,'Default Energy Data'!$E$4,'E for Groundwater Data'!Q5)","v":540},{"$f":"'Default Energy Data'!$K$4","v":8900},{"$f":"IF('E for Treatment Data'!Q23=0,IF('E for Treatment Data'!P31=0,'Default Energy Data'!$K$5,'E for Treatment Data'!P31),'E for Treatment Data'!Q23)","v":496.3023483680999},{"$f":"'Default Energy Data'!$K$6","v":1200},{"$f":"'Default Energy Data'!F41/2.205","v":418.71201814058958},0,0,0,0,0]
["Current",{"$f":"Population!F39*'Water Use Per Capita'!F40*'Water Supply'!F40","v":0},{"$f":"Population!F39*'Water Use Per Capita'!F40*'Water Supply'!F41","v":0},{"$f":"IF('E for Groundwater Data'!Q6=0,'Default Energy Data'!$E$4,'E for Groundwater Data'!Q6)","v":540},{"$f":"'Default Energy Data'!$K$4","v":8900},{"$f":"IF('E for Treatment Data'!Q25=0,IF('E for Treatment Data'!P31=0,'Default Energy Data'!$K$5,'E for Treatment Data'!P31),'E for Treatment Data'!Q25)","v":496.3023483680999},{"$f":"'Default Energy Data'!$K$6","v":1200},{"$f":"'Default Energy Data'!F41/2.205","v":418.71201814058958},0,0,0,0,0]
[2020,{"$f":"Population!G39*'Water Use Per Capita'!G40*'Water Supply'!G40","v":0},{"$f":"Population!G39*'Water Use Per Capita'!G40*'Water Supply'!G41","v":0},{"$f":"IF('E for Groundwater Data'!Q7=0,'Default Energy Data'!$E$4,'E for Groundwater Data'!Q7)","v":540},{"$f":"'Default Energy Data'!$K$4","v":8900},{"$f":"IF('E for Treatment Data'!P32=0,'Default Energy Data'!$K$5,'E for Treatment Data'!P32)","v":496.3023483680999},{"$f":"'Default Energy Data'!$K$6","v":1200},{"$f":"'Default Energy Data'!F41/2.205","v":418.71201814058958},0,0,0,0,0]
{"$rows_left_out":20}
{"sheet":"State Water Project Data","index":6,"n_rows":267,"n_cols":11,"rows_kept":267,"cut":false,"hidden":false,"merged":[[1,0,1,6],[5,10,8,14],[1,9,1,15],[14,10,18,14],[4,9,4,14],[10,10,12,14]]}
[]
["Imported Water Delivered Via the Santa Ana River",null,null,null,null,null,null,null,"Source:"]
[null,"Date","Monthly (ac-ft)",null,"Year","Annual (ac-ft)"]
[null,"1990-01-01",0,null,1990,{"$f":"SUM(C4:C15)","v":0}]
[null,"1990-02-01",0,null,1991,{"$f":"SUM(C16:C27)","v":0},null,null,null,"Instructions"]
[null,"1990-03-01",0,null,1992,{"$f":"SUM(C40:C51)","v":0},null,null,null,"Step 1:","If available, please enter monthly State Water Project data in column C.  The data will automatically be aggregated to annual data.  If data is not available, please leave blank"]
[null,"1990-04-01",0,null,1993,{"$f":"SUM(C7:C18)","v":0}]
[null,"1990-05-01",0,null,1994,{"$f":"SUM(C52:C63)","v":3094}]
{"$rows_left_out":260}
{"sheet":"Colorado River Water Data","index":7,"n_rows":267,"n_cols":11,"rows_kept":267,"cut":false,"hidden":false,"merged":[[14,10,18,14],[1,0,1,6],[1,9,1,15],[4,9,4,14],[5,10,8,14],[10,10,12,14]]}
[]
["Imported Water Delivered Via the Santa Ana River",null,null,null,null,null,null,null,"Source:"]
[null,"Date","Monthly (ac-ft)",null,"Year","Annual (ac-ft)"]
[null,"1990-01-01",0,null,1990,{"$f":"SUM(C4:C15)","v":27097.999999999996}]
[null,"1990-02-01",0,null,1991,{"$f":"SUM(C16:C27)","v":53109.399999999994},null,null,null,"Instructions"]
[null,"1990-03-01",2605.8000000000002,null,1992,{"$f":"SUM(C40:C51)","v":22970.400000000001},null,null,null,"Step 1:","If available, please enter monthly State Water Project data in column C.  The data will automatically be aggregated to annual data.  If data is not available, please leave blank"]
[null,"1990-04-01",9900,null,1993,{"$f":"SUM(C7:C18)","v":27209.899999999998}]
[null,"1990-05-01",294.60000000000002,null,1994,{"$f":"SUM(C52:C63)","v":74107.399999999994}]
{"$rows_left_out":260}
{"sheet":"Potable Water Treatment Data","index":8,"n_rows":266,"n_cols":20,"rows_kept":266,"cut":false,"hidden":false,"merged":[[13,19,17,23],[0,0,0,16],[0,19,0,25],[3,18,3,23],[4,19,7,23],[9,19,11,23]]}
["Potable Water Treatment Flow Data",null,null,null,null,null,null,null,null,null,null,null,null,null,null,null,null,null,"Source:"]
["Date","Flow per Month to Treatment Plant 1 (gal)","Flow per Month to Treatment Plant 2 (gal)","Flow per Month to Treatment Plant 3 (gal)","Flow per Month to Treatment Plant 4 (gal)","Flow per Month to Treatment Plant 5 (gal)","Flow per Month to Treatment Plant 6 (gal)","Flow per Month to Treatment Plant 7 (gal)","Flow per Month to Treatment Plant 8 (gal)","Flow per Month to Treatment Plant 9 (gal)","Flow per Month to Treatment Plant 10 (gal)","Flow per Month to Treatment Plant 11 (gal)","Total Monthly Flow to Treatment Plant (MG)",null,"Year","Total Annual Flow to Treatment Plant (MG)","Average Daily Flow per Year to Treatment Plant (MGD)"]
["1990-01-01",null,null,null,null,null,null,null,null,null,null,null,{"$f":"SUM(B3:L3)*0.000001","v":0},null,1990,{"$f":"SUM(M3:M14)","v":0},{"$f":"SUM(M3:M14)/365","v":0}]
["1990-02-01",null,null,null,null,null,null,null,null,null,null,null,{"$f":"SUM(B4:L4)*0.000001","v":0},null,1991,{"$f":"SUM(M15:M26)","v":0},{"$f":"SUM(M15:M26)/365","v":0},null,"Instructions"]
["1990-03-01",null,null,null,null,null,null,null,null,null,null,null,0,null,1992,{"$f":"SUM(M39:M50)","v":0},{"$f":"SUM(M39:M50)/365","v":0},null,"Step 1:","If available, please enter monthly flow data for all drinking water treatment plants in columns B-L., if not available please leave blank.  The data will automatically be summed and converted to MGD."]
["1990-04-01",null,null,null,null,null,null,null,null,null,null,null,0,null,1993,{"$f":"SUM(M6:M17)","v":0},{"$f":"SUM(M6:M17)/365","v":0}]
["1990-05-01",null,null,null,null,null,null,null,null,null,null,null,0,null,1994,{"$f":"SUM(M51:M62)","v":0},{"$f":"SUM(M51:M62)/365","v":0}]
["1990-06-01",null,null,null,null,null,null,null,null,null,null,null,0,null,1995,{"$f":"SUM(M63:M74)","v":0},{"$f":"SUM(M63:M74)/365","v":0}]
{"$rows_left_out":259}
{"sheet":"E for Treatment Data","index":9,"n_rows":266,"n_cols":20,"rows_kept":266,"cut":false,"hidden":false,"merged":[[13,19,17,23],[0,0,0,16],[0,19,0,25],[3,18,3,23],[4,19,7,23],[9,19,11,23]]}
["Potable Water Treatment Energy Data",null,null,null,null,null,null,null,null,null,null,null,null,null,null,null,null,null,"Source:","OCWD"]
["Date","Energy per Month to Treatment Plant 1 (KWh)","Energy per Month to Treatment Plant 2 (KWh)","Energy per Month to Treatment Plant 3 (KWh)","Energy per Month to Treatment Plant 4 (KWh)","Energy per Month to Treatment Plant 5 (KWh)","Energy per Month to Treatment Plant 6 (KWh)","Energy per Month to Treatment Plant 7 (KWh)","Energy per Month to Treatment Plant 8 (KWh)","Energy per Month to Treatment Plant 9 (KWh)","Energy per Month to Treatment Plant 10 (KWh)","Energy per Month to Treatment Plant 11 (KWh)","Total Energy per Month to Treatment Plant (KWh)",null,"Year","Total Energy per Year to Treatment Plant (KWh)","Water Intensities (KWh/MG)"]
["1990-01-01",null,null,null,null,null,null,null,null,null,null,null,{"$f":"SUM(B3:L3)","v":0},null,1990,{"$f":"SUM(M3:M14)","v":0},{"$f":"IF('Potable Water Treatment Data'!P3=0,0,P3/'Potable Water Treatment Data'!P3)","v":0}]
["1990-02-01",null,null,null,null,null,null,null,null,null,null,null,{"$f":"SUM(B4:L4)","v":0},null,1991,{"$f":"SUM(M15:M26)","v":0},{"$f":"IF('Potable Water Treatment Data'!P4=0,0,P4/'Potable Water Treatment Data'!P4)","v":0},null,"Instructions"]
["1990-03-01",null,null,null,null,null,null,null,null,null,null,null,0,null,1992,{"$f":"SUM(M39:M50)","v":0},{"$f":"IF('Potable Water Treatment Data'!P5=0,0,P5/'Potable Water Treatment Data'!P5)","v":0},null,"Step 1:","If available, please enter monthly energy data for all drinking water treatment plants in columns B-L., if not available please leave blank.  The data will automatically be summed and converted to intensities."]
["1990-04-01",null,null,null,null,null,null,null,null,null,null,null,0,null,1993,{"$f":"SUM(M6:M17)","v":0},{"$f":"IF('Potable Water Treatment Data'!P6=0,0,P6/'Potable Water Treatment Data'!P6)","v":0}]
["1990-05-01",null,null,null,null,null,null,null,null,null,null,null,0,null,1994,{"$f":"SUM(M51:M62)","v":0},{"$f":"IF('Potable Water Treatment Data'!P7=0,0,P7/'Potable Water Treatment Data'!P7)","v":0}]
["1990-06-01",null,null,null,null,null,null,null,null,null,null,null,0,null,1995,{"$f":"SUM(M63:M74)","v":0},{"$f":"IF('Potable Water Treatment Data'!P8=0,0,P8/'Potable Water Treatment Data'!P8)","v":0}]
{"$rows_left_out":259}
{"sheet":"Groundwater Data","index":10,"n_rows":266,"n_cols":19,"rows_kept":266,"cut":false,"hidden":false,"merged":[[13,18,17,22],[0,0,0,15],[0,19,0,25],[3,17,3,22],[4,18,7,22],[9,18,11,22]]}
["Groundwater Elevation Data",null,null,null,null,null,null,null,null,null,null,null,null,null,null,null,null,null,"Source:"]
["Date","Flow per Month from site 1 (gal)","Flow per Month from site 2 (gal)","Flow per Month from site 3 (gal)","Flow per Month from site 4 (gal)","Flow per Month from site 5 (gal)","Flow per Month from site 6 (gal)","Flow per Month from site 7 (gal)","Flow per Month from site 8 (gal)","Flow per Month from site 9 (gal)","Flow per Month from site 10 (gal)","Flow per Month from site 11 (gal)","Total Monthly Flow (MG)",null,"Year","Total Annual Flow (MG)"]
["1990-01-01",null,null,null,null,null,null,null,null,null,null,null,{"$f":"SUM(B3:L3)*0.000001","v":0},null,1990,{"$f":"SUM(M3:M14)","v":0}]
["1990-02-01",null,null,null,null,null,null,null,null,null,null,null,{"$f":"SUM(B4:L4)*0.000001","v":0},null,1991,{"$f":"SUM(M15:M26)","v":0},null,"Instructions"]
["1990-03-01",null,null,null,null,null,null,null,null,null,null,null,0,null,1992,{"$f":"SUM(M39:M50)","v":0},null,"Step 1:","If available, please enter monthly flow data for all ground water extraction points in columns B-L., if not available please leave blank.  The data will automatically be summed and converted to MG."]
["1990-04-01",null,null,null,null,null,null,null,null,null,null,null,0,null,1993,{"$f":"SUM(M6:M17)","v":0}]
["1990-05-01",null,null,null,null,null,null,null,null,null,null,null,0,null,1994,{"$f":"SUM(M51:M62)","v":0}]
["1990-06-01",null,null,null,null,null,null,null,null,null,null,null,0,null,1995,{"$f":"SUM(M63:M74)","v":0}]
{"$rows_left_out":259}
{"sheet":"E for Groundwater Data","index":11,"n_rows":266,"n_cols":20,"rows_kept":266,"cut":false,"hidden":false,"merged":[[13,19,17,23],[0,19,0,25],[0,0,0,16],[3,18,3,23],[4,19,7,23],[9,19,11,23]]}
["Groundwater Extraction Energy Data",null,null,null,null,null,null,null,null,null,null,null,null,null,null,null,null,null,"Source:","OCWD"]
["Date","Energy per Month for Groundwater Extraction (KWh)","Energy per Month for Groundwater Extraction (KWh)","Energy per Month for Groundwater Extraction (KWh)","Energy per Month for Groundwater Extraction (KWh)","Energy per Month for Groundwater Extraction (KWh)","Energy per Month for Groundwater Extraction (KWh)","Energy per Month for Groundwater Extraction (KWh)","Energy per Month for Groundwater Extraction (KWh)","Energy per Month for Groundwater Extraction (KWh)","Energy per Month for Groundwater Extraction (KWh)","Energy per Month for Groundwater Extraction (KWh)","Energy per Month for Groundwater Extraction (KWh)",null,"Year","Total Energy per Year for GW Extraction (KWh)","Water Intensities (KWh/MG)"]
["1990-01-01",null,null,null,null,null,null,null,null,null,null,null,{"$f":"SUM(B3:L3)","v":0},null,1990,{"$f":"SUM(M3:M14)","v":0},{"$f":"IF('Groundwater Data'!P3=0,0,P3/'Groundwater Data'!P3)","v":0}]
["1990-02-01",null,null,null,null,null,null,null,null,null,null,null,{"$f":"SUM(B4:L4)","v":0},null,1991,{"$f":"SUM(M15:M26)","v":0},{"$f":"IF('Groundwater Data'!P4=0,0,P4/'Groundwater Data'!P4)","v":0},null,"Instructions"]
["1990-03-01",null,null,null,null,null,null,null,null,null,null,null,0,null,1992,{"$f":"SUM(M39:M50)","v":0},{"$f":"IF('Groundwater Data'!P5=0,0,P5/'Groundwater Data'!P5)","v":0},null,"Step 1:","If available, please enter monthly energy data for all groundwater extraction points in columns B-L., if not available please leave blank.  The data will automatically be summed and converted to intensities."]
["1990-04-01",null,null,null,null,null,null,null,null,null,null,null,0,null,1993,{"$f":"SUM(M6:M17)","v":0},{"$f":"IF('Groundwater Data'!P6=0,0,P6/'Groundwater Data'!P6)","v":0}]
["1990-05-01",null,null,null,null,null,null,null,null,null,null,null,0,null,1994,{"$f":"SUM(M51:M62)","v":0},{"$f":"IF('Groundwater Data'!P7=0,0,P7/'Groundwater Data'!P7)","v":0}]
["1990-06-01",null,null,null,null,null,null,null,null,null,null,null,0,null,1995,{"$f":"SUM(M63:M74)","v":0},{"$f":"IF('Groundwater Data'!P8=0,0,P8/'Groundwater Data'!P8)","v":0}]
{"$rows_left_out":259}
{"sheet":"Default Energy Data","index":12,"n_rows":42,"n_cols":14,"rows_kept":42,"cut":false,"hidden":false,"merged":[[1,7,1,11],[2,7,2,9],[7,1,7,5],[1,1,1,5],[2,1,2,3],[5,2,5,5],[4,7,4,9],[5,7,5,9],[12,2,12,5],[15,8,15,9],[16,8,16,9],[6,8,6,11],[21,1,21,5],[8,8,8,11],[9,8,9,10],[41,2,41,5],[17,9,17,13],[13,9,13,11],[14,1,14,5],[19,2,19,6]]}
[]
[null,"Energy intensities for Groundwater Extraction",null,null,null,null,null,"California Specific Water Intensities"]
[null,null,null,null,"Groundwater Extraction (kWh/MG)","Water Table Depth (ft)",null,"Water use cycle segments",null,null,"So Cal (kWh/MG)","No Cal (kWh/MG)"]
[null,"Low Value (default)",null,null,540,120,null,"Supply and Conveyance",null,null,8900,150]
[null,"High Value",null,null,2270,500,null,"Treatment",null,null,100,100]
[null,"Source:","From Energy Down the Drain: The Hidden Costs of California's Water Supply, NRDC and The Pacific Institute, 2004 page 11",null,null,null,null,"Distribution",null,null,1200,1200]
[null,null,null,null,null,null,null,"Source:","http://www.energy.ca.gov/2005publications/CEC‐700‐2005‐011/CEC‐700‐2005‐011‐SF.PDF, Table 1‐3.Ibid. The distinction between Northern and Southern California is detailed on page 111 of the CEC report."]
[null,"Energy intensities for Water Conveyance"]
{"$rows_left_out":34}